Target
Apoptosis regulator Bcl-2
Ligand
BDBM33172
Substrate
Meas. Tech.
Multiplexed high-throughput screen for small molecule regulators of Bcl-2 family protein interactions, specifically Bim-Bcl-2
EC50
9760±n/a nM
Citation
 PubChem, PC Multiplexed high-throughput screen for small molecule regulators of Bcl-2 family protein interactions, specifically Bim-Bcl-2 PubChem Bioassay (2008)[AID] 
Target
Name:
Apoptosis regulator Bcl-2
Synonyms:
Apoptosis regulator Bcl-2 Protein BCL-2 BCL2_HUMAN | Bcl-2 Protein
Type:
Homodimer or heterodimer
Mol. Mass.:
26269.11
Organism:
Homo sapiens (Human)
Description:
P10415
Residue:
239
  
Inhibitor
Name:
BDBM33172
Synonyms:
2-(2-furanyl)-1H-perimidine 2-(furan-2-yl)-1H-perimidine SMR000284057 | cid_376355
Type:
Small organic molecule
Emp. Form.:
C15H10N2O
Mol. Mass.:
234.2527
SMILES:
c1coc(c1)-c1nc2cccc3cccc([nH]1)c23
: