Target
Induced myeloid leukemia cell differentiation protein Mcl-1
Ligand
BDBM29643
Substrate
Meas. Tech.
Multiplexed dose response screen for small molecule regulators of Bcl-2 family protein interactions, specifically Bim-Mcl-1.
EC50
38570±n/a nM
Citation
 PubChem, PC Multiplexed dose response screen for small molecule regulators of Bcl-2 family protein interactions, specifically Bim-Mcl-1. PubChem Bioassay (2008)[AID] 
Target
Name:
Induced myeloid leukemia cell differentiation protein Mcl-1
Synonyms:
BCL2L3 Bcl-2-like protein 3 (Mcl-1) Bcl2-L-3 MCL1 Mcl-1 Myeloid cell leukemia sequence 1 (BCL2-related) | mcl1/EAT
Type:
Membrane; Single-pass membrane protein
Mol. Mass.:
37332.87
Organism:
Homo sapiens (Human)
Description:
Q07820
Residue:
350
  
Inhibitor
Name:
BDBM29643
Synonyms:
(6aS)-6-methyl-5,6,6a,7-tetrahydro-4H-dibenzo[de,g]quinoline-10,11-diol;hydrochloride Apomorphine,(+) MLS000028867 SMR000058671 cid_6852389
Type:
Small organic molecule
Emp. Form.:
C17H17NO2
Mol. Mass.:
267.3224
SMILES:
CN1CCc2cccc-3c2[C@@H]1Cc1ccc(O)c(O)c-31
: