Target
Induced myeloid leukemia cell differentiation protein Mcl-1
Ligand
BDBM32282
Substrate
Meas. Tech.
Multiplexed dose response screen for small molecule regulators of Bcl-2 family protein interactions, specifically Bim-Mcl-1.
EC50
1850±n/a nM
Citation
 PubChem, PC Multiplexed dose response screen for small molecule regulators of Bcl-2 family protein interactions, specifically Bim-Mcl-1. PubChem Bioassay (2008)[AID] 
Target
Name:
Induced myeloid leukemia cell differentiation protein Mcl-1
Synonyms:
BCL2L3 Bcl-2-like protein 3 (Mcl-1) Bcl2-L-3 MCL1 Mcl-1 Myeloid cell leukemia sequence 1 (BCL2-related) | mcl1/EAT
Type:
Membrane; Single-pass membrane protein
Mol. Mass.:
37332.87
Organism:
Homo sapiens (Human)
Description:
Q07820
Residue:
350
  
Inhibitor
Name:
BDBM32282
Synonyms:
2-[[2-amino-1-(3-ethoxypropyl)pyrrolo[3,2-b]quinoxaline-3-carbonyl]amino]-4,5,6,7-tetrahydrobenzothiophene-3-carboxylic acid methyl ester 2-{[2-Amino-1-(3-ethoxy-propyl)-1H-pyrrolo[2,3-b]quinoxaline-3-carbonyl]-amino}-4,5,6,7-tetrahydro-be nzo[b]thiophene-3-carboxylic acid methyl ester SMR000149847 methyl 2-[[2-amino-1-(3-ethoxypropyl)pyrrolo[3,2-b]quinoxaline-3-carbonyl]amino]-4,5,6,7-tetrahydro-1-benzothiophene-3-carboxylate | methyl 2-[[2-azanyl-1-(3-ethoxypropyl)pyrrolo[3,2-b]quinoxalin-3-yl]carbonylamino]-4,5,6,7-tetrahydro-1-benzothiophene-3-carboxylate
Type:
Small organic molecule
Emp. Form.:
C26H29N5O4S
Mol. Mass.:
507.605
SMILES:
CCOCCCn1c(N)c(C(=O)Nc2sc3CCCCc3c2C(=O)OC)c2nc3ccccc3nc12
: