Target
Induced myeloid leukemia cell differentiation protein Mcl-1
Ligand
BDBM32289
Substrate
Meas. Tech.
Multiplexed dose response screen for small molecule regulators of Bcl-2 family protein interactions, specifically Bim-Mcl-1.
EC50
16290±n/a nM
Citation
 PubChem, PC Multiplexed dose response screen for small molecule regulators of Bcl-2 family protein interactions, specifically Bim-Mcl-1. PubChem Bioassay (2008)[AID] 
Target
Name:
Induced myeloid leukemia cell differentiation protein Mcl-1
Synonyms:
BCL2L3 Bcl-2-like protein 3 (Mcl-1) Bcl2-L-3 MCL1 Mcl-1 Myeloid cell leukemia sequence 1 (BCL2-related) | mcl1/EAT
Type:
Membrane; Single-pass membrane protein
Mol. Mass.:
37332.87
Organism:
Homo sapiens (Human)
Description:
Q07820
Residue:
350
  
Inhibitor
Name:
BDBM32289
Synonyms:
2-[(1-prop-2-ynyl-3-indolyl)methylidene]indene-1,3-dione 2-[(1-propargylindol-3-yl)methylene]indane-1,3-quinone MLS000574697 cid_807202
Type:
Small organic molecule
Emp. Form.:
C21H13NO2
Mol. Mass.:
311.3334
SMILES:
O=[#6]-1\[#6](=[#6]\c2cn(-[#6]C#C)c3ccccc23)-[#6](=O)-c2ccccc-12
: