Target
Induced myeloid leukemia cell differentiation protein Mcl-1
Ligand
BDBM32296
Substrate
Meas. Tech.
Multiplexed dose response screen for small molecule regulators of Bcl-2 family protein interactions, specifically Bim-Mcl-1.
EC50
2610±n/a nM
Citation
 PubChem, PC Multiplexed dose response screen for small molecule regulators of Bcl-2 family protein interactions, specifically Bim-Mcl-1. PubChem Bioassay (2008)[AID] 
Target
Name:
Induced myeloid leukemia cell differentiation protein Mcl-1
Synonyms:
BCL2L3 Bcl-2-like protein 3 (Mcl-1) Bcl2-L-3 MCL1 Mcl-1 Myeloid cell leukemia sequence 1 (BCL2-related) | mcl1/EAT
Type:
Membrane; Single-pass membrane protein
Mol. Mass.:
37332.87
Organism:
Homo sapiens (Human)
Description:
Q07820
Residue:
350
  
Inhibitor
Name:
BDBM32296
Synonyms:
(E)-1-(4-methylphenyl)-3-[5-(4-methylphenyl)-2-furanyl]-2-propen-1-one (E)-1-(p-tolyl)-3-[5-(p-tolyl)-2-furyl]prop-2-en-1-one MLS000569175 cid_5758250
Type:
Small organic molecule
Emp. Form.:
C21H18O2
Mol. Mass.:
302.3664
SMILES:
Cc1ccc(cc1)C(=O)\C=C\c1ccc(o1)-c1ccc(C)cc1
: