Target
Induced myeloid leukemia cell differentiation protein Mcl-1
Ligand
BDBM32308
Substrate
Meas. Tech.
Multiplexed dose response screen for small molecule regulators of Bcl-2 family protein interactions, specifically Bim-Mcl-1.
EC50
20670±n/a nM
Citation
 PubChem, PC Multiplexed dose response screen for small molecule regulators of Bcl-2 family protein interactions, specifically Bim-Mcl-1. PubChem Bioassay (2008)[AID] 
Target
Name:
Induced myeloid leukemia cell differentiation protein Mcl-1
Synonyms:
BCL2L3 Bcl-2-like protein 3 (Mcl-1) Bcl2-L-3 MCL1 Mcl-1 Myeloid cell leukemia sequence 1 (BCL2-related) | mcl1/EAT
Type:
Membrane; Single-pass membrane protein
Mol. Mass.:
37332.87
Organism:
Homo sapiens (Human)
Description:
Q07820
Residue:
350
  
Inhibitor
Name:
BDBM32308
Synonyms:
(Z)-1-phenyl-3-(5-phenyl-2-furanyl)-2-propen-1-one (Z)-1-phenyl-3-(5-phenylfuran-2-yl)prop-2-en-1-one SMR000236018 | cid_5708162
Type:
Small organic molecule
Emp. Form.:
C19H14O2
Mol. Mass.:
274.3133
SMILES:
O=C(\C=C/c1ccc(o1)-c1ccccc1)c1ccccc1
: