Target
Induced myeloid leukemia cell differentiation protein Mcl-1
Ligand
BDBM33155
Substrate
Meas. Tech.
Multiplexed dose response screen for small molecule regulators of Bcl-2 family protein interactions, specifically Bim-Mcl-1.
EC50
10940±n/a nM
Citation
 PubChem, PC Multiplexed dose response screen for small molecule regulators of Bcl-2 family protein interactions, specifically Bim-Mcl-1. PubChem Bioassay (2008)[AID] 
Target
Name:
Induced myeloid leukemia cell differentiation protein Mcl-1
Synonyms:
BCL2L3 Bcl-2-like protein 3 (Mcl-1) Bcl2-L-3 MCL1 Mcl-1 Myeloid cell leukemia sequence 1 (BCL2-related) | mcl1/EAT
Type:
Membrane; Single-pass membrane protein
Mol. Mass.:
37332.87
Organism:
Homo sapiens (Human)
Description:
Q07820
Residue:
350
  
Inhibitor
Name:
BDBM33155
Synonyms:
MLS000666146 N-[2,3-bis(2-furanyl)-6-quinoxalinyl]-4-(2-pyridinyl)-1-piperazinecarboxamide N-[2,3-bis(furan-2-yl)quinoxalin-6-yl]-4-pyridin-2-yl-piperazine-1-carboxamide SMR000271449 | cid_1278518
Type:
Small organic molecule
Emp. Form.:
C26H22N6O3
Mol. Mass.:
466.4913
SMILES:
O=C(Nc1ccc2nc(-c3ccco3)c(nc2c1)-c1ccco1)N1CCN(CC1)c1ccccn1
: