Target
Cell division control protein 42 homolog
Ligand
BDBM43208
Substrate
Meas. Tech.
Multiplex dose response to identify specific small molecule inhibitors of Ras and Ras-related GTPases specifically Cdc42 activated mutant
EC50
2790±n/a nM
Citation
 PubChem, PC Multiplex dose response to identify specific small molecule inhibitors of Ras and Ras-related GTPases specifically Cdc42 activated mutant PubChem Bioassay (2010)[AID] 
Target
Name:
Cell division control protein 42 homolog
Synonyms:
CDC42 Cell division control protein 42 homolog cell division cycle 42 (GTP binding protein, 25kDa)
Type:
PROTEIN
Mol. Mass.:
21258.36
Organism:
Homo sapiens (Human)
Description:
ChEMBL_652970
Residue:
191
  
Inhibitor
Name:
BDBM43208
Synonyms:
4-benzyl-N-[5-(2,3-dihydro-1,4-benzodioxin-6-yl)-1,3,4-oxadiazol-2-yl]benzamide N-[5-(2,3-dihydro-1,4-benzodioxin-6-yl)-1,3,4-oxadiazol-2-yl]-4-(phenylmethyl)benzamide cid_3404474
Type:
Small organic molecule
Emp. Form.:
C24H19N3O4
Mol. Mass.:
413.4254
SMILES:
O=C(Nc1nnc(o1)-c1ccc2OCCOc2c1)c1ccc(Cc2ccccc2)cc1
: