Target
Cell division control protein 42 homolog
Ligand
BDBM43216
Substrate
Meas. Tech.
Multiplex dose response to identify specific small molecule inhibitors of Ras and Ras-related GTPases specifically Cdc42 activated mutant
EC50
16500±n/a nM
Citation
 PubChem, PC Multiplex dose response to identify specific small molecule inhibitors of Ras and Ras-related GTPases specifically Cdc42 activated mutant PubChem Bioassay (2010)[AID] 
Target
Name:
Cell division control protein 42 homolog
Synonyms:
CDC42 Cell division control protein 42 homolog cell division cycle 42 (GTP binding protein, 25kDa)
Type:
PROTEIN
Mol. Mass.:
21258.36
Organism:
Homo sapiens (Human)
Description:
ChEMBL_652970
Residue:
191
  
Inhibitor
Name:
BDBM43216
Synonyms:
(5Z)-2-(3,4-dihydro-1H-isoquinolin-2-yl)-5-(4-ethoxybenzylidene)-2-thiazolin-4-one (5Z)-2-(3,4-dihydro-1H-isoquinolin-2-yl)-5-[(4-ethoxyphenyl)methylidene]-4-thiazolone MLS000590730 cid_1876676
Type:
Small organic molecule
Emp. Form.:
C21H20N2O2S
Mol. Mass.:
364.461
SMILES:
CCOc1ccc(\C=C2/SC(=NC2=O)N2CCc3ccccc3C2)cc1
: