Target
GTPase KRas [1-37]
Ligand
BDBM43221
Substrate
Meas. Tech.
Multiplexed dose response to identify specific small molecule inhibitors of Ras and Ras-related GTPases specifically Ras wildtype
EC50
99.33±n/a nM
Citation
 PubChem, PC Multiplexed dose response to identify specific small molecule inhibitors of Ras and Ras-related GTPases specifically Ras wildtype PubChem Bioassay (2010)[AID] 
Target
Name:
GTPase KRas [1-37]
Synonyms:
ras protein
Type:
Enzyme Catalytic Domain
Mol. Mass.:
4034.04
Organism:
Homo sapiens (Human)
Description:
gi_190938
Residue:
37
  
Inhibitor
Name:
BDBM43221
Synonyms:
2-(benzoylcarbamothioylamino)-5,5-dimethyl-4,7-dihydrothieno[2,3-c]pyran-3-carboxylic acid 2-[[benzamido(sulfanylidene)methyl]amino]-5,5-dimethyl-4,7-dihydrothieno[2,3-c]pyran-3-carboxylic acid 5,5-dimethyl-2-(phenylcarbonylcarbamothioylamino)-4,7-dihydrothieno[2,3-c]pyran-3-carboxylic acid SMR000297947 | cid_1067700
Type:
Small organic molecule
Emp. Form.:
C18H18N2O4S2
Mol. Mass.:
390.477
SMILES:
CC1(C)Cc2c(CO1)sc(NC(=S)NC(=O)c1ccccc1)c2C(O)=O
: