Target
Ras-related C3 botulinum toxin substrate 1
Ligand
BDBM43260
Substrate
Meas. Tech.
Multiplex dose response to identify specific small molecule inhibitors of Ras and Ras-related GTPases specifically Rac activated mutant
EC50
14180±n/a nM
Citation
 PubChem, PC Multiplex dose response to identify specific small molecule inhibitors of Ras and Ras-related GTPases specifically Rac activated mutant PubChem Bioassay (2010)[AID] 
Target
Name:
Ras-related C3 botulinum toxin substrate 1
Synonyms:
RAC1_MOUSE Rac1 protein
Type:
PROTEIN
Mol. Mass.:
21455.91
Organism:
Mus musculus
Description:
EBI_101485
Residue:
192
  
Inhibitor
Name:
BDBM43260
Synonyms:
4-[(3,5-dimethyl-4-isoxazolyl)methoxy]-3-methoxybenzoic acid [2-[(2,2-difluoro-1,3-benzodioxol-5-yl)amino]-2-oxoethyl] ester MLS000055954 [2-[(2,2-difluoro-1,3-benzodioxol-5-yl)amino]-2-oxoethyl] 4-[(3,5-dimethyl-1,2-oxazol-4-yl)methoxy]-3-methoxybenzoate cid_2549881
Type:
Small organic molecule
Emp. Form.:
C23H20F2N2O8
Mol. Mass.:
490.4103
SMILES:
COc1cc(ccc1OCc1c(C)noc1C)C(=O)OCC(=O)Nc1ccc2OC(F)(F)Oc2c1
: