Target
Ras-related C3 botulinum toxin substrate 1
Ligand
BDBM43261
Substrate
Meas. Tech.
Multiplex dose response to identify specific small molecule inhibitors of Ras and Ras-related GTPases specifically Rac activated mutant
EC50
45590±n/a nM
Citation
 PubChem, PC Multiplex dose response to identify specific small molecule inhibitors of Ras and Ras-related GTPases specifically Rac activated mutant PubChem Bioassay (2010)[AID] 
Target
Name:
Ras-related C3 botulinum toxin substrate 1
Synonyms:
RAC1_MOUSE Rac1 protein
Type:
PROTEIN
Mol. Mass.:
21455.91
Organism:
Mus musculus
Description:
EBI_101485
Residue:
192
  
Inhibitor
Name:
BDBM43261
Synonyms:
3-ethyl-4-keto-phthalazine-1-carboxylic acid [2-[2,5-dimethyl-1-(2-thenyl)pyrrol-3-yl]-2-keto-ethyl] ester MLS000097569 [2-[2,5-dimethyl-1-(thiophen-2-ylmethyl)pyrrol-3-yl]-2-oxidanylidene-ethyl] 3-ethyl-4-oxidanylidene-phthalazine-1-carboxylate cid_2079190
Type:
Small organic molecule
Emp. Form.:
C24H23N3O4S
Mol. Mass.:
449.522
SMILES:
CCn1nc(C(=O)OCC(=O)c2cc(C)n(Cc3cccs3)c2C)c2ccccc2c1=O
: