Target
RAC-alpha serine/threonine-protein kinase
Ligand
BDBM32358
Substrate
Meas. Tech.
AKT counterscreen of confirmed PKD inhibitors-57K library
IC50
>100000±n/a nM
Citation
 PubChem, PC AKT counterscreen of confirmed PKD inhibitors-57K library PubChem Bioassay (2008)[AID] 
Target
Name:
RAC-alpha serine/threonine-protein kinase
Synonyms:
AKT phosphorylation (p-AKT) AKT1/PPP1CA C-AKT PKB alpha Protein kinase B Protein kinase B (Akt 1) Protein kinase B alpha Proto-oncogene Akt (Akt1) Proto-oncogene c-Akt (AKT1) RAC-PK-alpha RAC-alpha serine/threonine-protein kinase (AKT1) | RAC-alpha serine/threonine-protein kinase (pAKT)
Type:
Enzyme
Mol. Mass.:
55681.25
Organism:
Homo sapiens (Human)
Description:
P31749
Residue:
480
  
Inhibitor
Name:
BDBM32358
Synonyms:
2-chloro-5-(1-piperidinylsulfonyl)benzoic acid [2-[[(1-methyl-2-pyrrolyl)-oxomethyl]amino]-2-oxoethyl] ester MLS001002843 [2-[(1-methylpyrrol-2-yl)carbonylamino]-2-oxidanylidene-ethyl] 2-chloranyl-5-piperidin-1-ylsulfonyl-benzoate cid_2438071
Type:
Small organic molecule
Emp. Form.:
C20H22ClN3O6S
Mol. Mass.:
467.923
SMILES:
Cn1cccc1C(=O)NC(=O)COC(=O)c1cc(ccc1Cl)S(=O)(=O)N1CCCCC1
: