Target
Cyclin-dependent kinase 7
Ligand
BDBM32350
Substrate
Meas. Tech.
CDK7 counterscreen of confirmed PKD inhibitors-57K library addition
IC50
>100000±n/a nM
Citation
 PubChem, PC CDK7 counterscreen of confirmed PKD inhibitors-57K library addition PubChem Bioassay (2008)[AID] 
Target
Name:
Cyclin-dependent kinase 7
Synonyms:
39 kDa protein kinase CAK1 CDK-activating kinase 1 (CAK) CDK7_HUMAN Cell division protein kinase 7 Cyclin-dependent kinase 7 (CDK7/cyclin H) P39 Mo15 TFIIH basal transcription factor complex kinase subunit
Type:
Enzyme Subunit
Mol. Mass.:
39047.01
Organism:
Homo sapiens (Human)
Description:
Residue:
346
  
Inhibitor
Name:
BDBM32350
Synonyms:
MLS000708313 N-[2-(pyrrolidine-1-carbonyl)phenyl]-2,3-dihydro-1,4-benzodioxin-3-carboxamide N-[2-[oxo(1-pyrrolidinyl)methyl]phenyl]-2,3-dihydro-1,4-benzodioxin-3-carboxamide cid_3152117
Type:
Small organic molecule
Emp. Form.:
C20H20N2O4
Mol. Mass.:
352.3838
SMILES:
O=C(Nc1ccccc1C(=O)N1CCCC1)C1COc2ccccc2O1
: