Target
Cyclin-dependent kinase 7
Ligand
BDBM32355
Substrate
Meas. Tech.
CDK7 counterscreen of confirmed PKD inhibitors-57K library addition
IC50
>100000±n/a nM
Citation
 PubChem, PC CDK7 counterscreen of confirmed PKD inhibitors-57K library addition PubChem Bioassay (2008)[AID] 
Target
Name:
Cyclin-dependent kinase 7
Synonyms:
39 kDa protein kinase CAK1 CDK-activating kinase 1 (CAK) CDK7_HUMAN Cell division protein kinase 7 Cyclin-dependent kinase 7 (CDK7/cyclin H) P39 Mo15 TFIIH basal transcription factor complex kinase subunit
Type:
Enzyme Subunit
Mol. Mass.:
39047.01
Organism:
Homo sapiens (Human)
Description:
Residue:
346
  
Inhibitor
Name:
BDBM32355
Synonyms:
MLS000730065 N-cyclopentyl-3-(4-methoxybenzyl)-2,4-dioxo-1,2,3,4-tetrahydroquinazoline-7-carboxamide N-cyclopentyl-3-[(4-methoxyphenyl)methyl]-2,4-dioxo-1H-quinazoline-7-carboxamide cid_16195425
Type:
Small organic molecule
Emp. Form.:
C22H23N3O4
Mol. Mass.:
393.4357
SMILES:
COc1ccc(Cn2c(=O)[nH]c3cc(ccc3c2=O)C(=O)NC2CCCC2)cc1
: