Target
Cyclin-dependent kinase 7
Ligand
BDBM32359
Substrate
Meas. Tech.
CDK7 counterscreen of confirmed PKD inhibitors-57K library addition
IC50
>100000±n/a nM
Citation
 PubChem, PC CDK7 counterscreen of confirmed PKD inhibitors-57K library addition PubChem Bioassay (2008)[AID] 
Target
Name:
Cyclin-dependent kinase 7
Synonyms:
39 kDa protein kinase CAK1 CDK-activating kinase 1 (CAK) CDK7_HUMAN Cell division protein kinase 7 Cyclin-dependent kinase 7 (CDK7/cyclin H) P39 Mo15 TFIIH basal transcription factor complex kinase subunit
Type:
Enzyme Subunit
Mol. Mass.:
39047.01
Organism:
Homo sapiens (Human)
Description:
Residue:
346
  
Inhibitor
Name:
BDBM32359
Synonyms:
MLS000772778 N-(2-naphthyl)-2-(4-pyridylthio)acetamide N-naphthalen-2-yl-2-pyridin-4-ylsulfanylacetamide cid_2103808
Type:
Small organic molecule
Emp. Form.:
C17H14N2OS
Mol. Mass.:
294.371
SMILES:
O=C(CSc1ccncc1)Nc1ccc2ccccc2c1
: