Target
Serine/threonine-protein kinase PLK1
Ligand
BDBM32335
Substrate
Meas. Tech.
PLK1 counterscreening assay for identified PKD inhibitors
IC50
>50000±n/a nM
Citation
 PubChem, PC PLK1 counterscreening assay for identified PKD inhibitors PubChem Bioassay (2008)[AID] 
Target
Name:
Serine/threonine-protein kinase PLK1
Synonyms:
PLK PLK1 Polo-like kinase 1 (PlK1) STPK13 Serine/threonine-protein kinase 13 | polo-like kinase
Type:
Serine/threonine-protein kinase
Mol. Mass.:
68277.16
Organism:
Homo sapiens (Human)
Description:
P53350
Residue:
603
  
Inhibitor
Name:
BDBM32335
Synonyms:
MLS000087884 N-[2-(2-methylphenyl)-4,6-dihydrothieno[3,4-c]pyrazol-3-yl]propanamide SMR000024203 | cid_3238449
Type:
Small organic molecule
Emp. Form.:
C15H17N3OS
Mol. Mass.:
287.38
SMILES:
CCC(=O)Nc1c2CSCc2nn1-c1ccccc1C
: