Target
DNA-directed RNA polymerase subunit beta
Ligand
BDBM43296
Substrate
Meas. Tech.
RNA polymerase SAR
IC50
>50000±n/a nM
Citation
 PubChem, PC RNA polymerase SAR PubChem Bioassay (2008)[AID] 
Target
Name:
DNA-directed RNA polymerase subunit beta
Synonyms:
RNA polymerase beta subunit (EC 2.7.7.6)
Type:
Enzyme Catalytic Domain
Mol. Mass.:
150595.80
Organism:
Escherichia coli
Description:
A0A0E2LB94
Residue:
1342
  
Inhibitor
Name:
BDBM43296
Synonyms:
N-(3-hydroxyphenyl)-2,5-dimethoxy-benzenesulfonamide PC-0596524 cid_4254071
Type:
Small organic molecule
Emp. Form.:
C14H15NO5S
Mol. Mass.:
309.338
SMILES:
COc1ccc(OC)c(c1)S(=O)(=O)Nc1cccc(O)c1
: