Target
DNA-directed RNA polymerase subunit beta
Ligand
BDBM43300
Substrate
Meas. Tech.
RNA polymerase SAR
IC50
>50000±n/a nM
Citation
 PubChem, PC RNA polymerase SAR PubChem Bioassay (2008)[AID] 
Target
Name:
DNA-directed RNA polymerase subunit beta
Synonyms:
RNA polymerase beta subunit (EC 2.7.7.6)
Type:
Enzyme Catalytic Domain
Mol. Mass.:
150595.80
Organism:
Escherichia coli
Description:
A0A0E2LB94
Residue:
1342
  
Inhibitor
Name:
BDBM43300
Synonyms:
4-methoxy-N-phenyl-benzenesulfonamide PC-0596528 cid_835273
Type:
Small organic molecule
Emp. Form.:
C13H13NO3S
Mol. Mass.:
263.312
SMILES:
COc1ccc(cc1)S(=O)(=O)Nc1ccccc1
: