Target
DNA-directed RNA polymerase subunit beta
Ligand
BDBM43318
Substrate
Meas. Tech.
RNA polymerase SAR
IC50
>50000±n/a nM
Citation
 PubChem, PC RNA polymerase SAR PubChem Bioassay (2008)[AID] 
Target
Name:
DNA-directed RNA polymerase subunit beta
Synonyms:
RNA polymerase beta subunit (EC 2.7.7.6)
Type:
Enzyme Catalytic Domain
Mol. Mass.:
150595.80
Organism:
Escherichia coli
Description:
A0A0E2LB94
Residue:
1342
  
Inhibitor
Name:
BDBM43318
Synonyms:
N-(1H-indol-5-yl)-2,5-dimethoxy-benzamide PC-0626763 cid_16738594
Type:
Small organic molecule
Emp. Form.:
C17H16N2O3
Mol. Mass.:
296.3205
SMILES:
COc1ccc(OC)c(c1)C(=O)Nc1ccc2[nH]ccc2c1
: