Target
DNA-directed RNA polymerase subunit beta
Ligand
BDBM43320
Substrate
Meas. Tech.
RNA polymerase SAR
IC50
33052±n/a nM
Citation
 PubChem, PC RNA polymerase SAR PubChem Bioassay (2008)[AID] 
Target
Name:
DNA-directed RNA polymerase subunit beta
Synonyms:
RNA polymerase beta subunit (EC 2.7.7.6)
Type:
Enzyme Catalytic Domain
Mol. Mass.:
150595.80
Organism:
Escherichia coli
Description:
A0A0E2LB94
Residue:
1342
  
Inhibitor
Name:
BDBM43320
Synonyms:
3,4-dimethoxy-N-(2-oxidanylnaphthalen-1-yl)benzamide N-(2-hydroxy-1-naphthyl)-3,4-dimethoxy-benzamide PC-0626765 cid_223048
Type:
Small organic molecule
Emp. Form.:
C19H17NO4
Mol. Mass.:
323.3426
SMILES:
COc1ccc(cc1OC)C(=O)Nc1c(O)ccc2ccccc12
: