Target
DNA-directed RNA polymerase subunit beta
Ligand
BDBM43325
Substrate
Meas. Tech.
RNA polymerase SAR
IC50
>50000±n/a nM
Citation
 PubChem, PC RNA polymerase SAR PubChem Bioassay (2008)[AID] 
Target
Name:
DNA-directed RNA polymerase subunit beta
Synonyms:
RNA polymerase beta subunit (EC 2.7.7.6)
Type:
Enzyme Catalytic Domain
Mol. Mass.:
150595.80
Organism:
Escherichia coli
Description:
A0A0E2LB94
Residue:
1342
  
Inhibitor
Name:
BDBM43325
Synonyms:
1-(4-fluorophenyl)-3-(4-hydroxy-1-naphthalenyl)urea 1-(4-fluorophenyl)-3-(4-hydroxynaphthalen-1-yl)urea PC-0626770 cid_16738600
Type:
Small organic molecule
Emp. Form.:
C17H13FN2O2
Mol. Mass.:
296.2957
SMILES:
Oc1ccc(NC(=O)Nc2ccc(F)cc2)c2ccccc12
: