Target
DNA-directed RNA polymerase subunit beta
Ligand
BDBM43329
Substrate
Meas. Tech.
RNA polymerase SAR
IC50
>50000±n/a nM
Citation
 PubChem, PC RNA polymerase SAR PubChem Bioassay (2008)[AID] 
Target
Name:
DNA-directed RNA polymerase subunit beta
Synonyms:
RNA polymerase beta subunit (EC 2.7.7.6)
Type:
Enzyme Catalytic Domain
Mol. Mass.:
150595.80
Organism:
Escherichia coli
Description:
A0A0E2LB94
Residue:
1342
  
Inhibitor
Name:
BDBM43329
Synonyms:
1-(2,5-dimethoxyphenyl)-3-(2-hydroxy-1-naphthalenyl)urea 1-(2,5-dimethoxyphenyl)-3-(2-hydroxynaphthalen-1-yl)urea PC-0626774 cid_16738604
Type:
Small organic molecule
Emp. Form.:
C19H18N2O4
Mol. Mass.:
338.3572
SMILES:
COc1ccc(OC)c(NC(=O)Nc2c(O)ccc3ccccc23)c1
: