Target
E3 ubiquitin-protein ligase Mdm2
Ligand
BDBM43370
Substrate
Meas. Tech.
E3 Ligase dose-response_384
EC50
13250±n/a nM
Citation
 PubChem, PC E3 Ligase dose-response_384 PubChem Bioassay (2008)[AID] 
Target
Name:
E3 ubiquitin-protein ligase Mdm2
Synonyms:
Double minute 2 protein E3 ubiquitin-protein ligase Mdm2 (p53-binding protein Mdm2) Human Double Minute 2 (HDM2) MDM2-MDMX p53-Binding Protein MDM2 | p53-binding protein
Type:
Oncoprotein
Mol. Mass.:
55196.54
Organism:
Homo sapiens (Human)
Description:
Q00987
Residue:
491
  
Inhibitor
Name:
BDBM43370
Synonyms:
2-(1-ethyl-2,4-diketo-quinazolin-3-yl)-N-(3,4,5-trimethoxyphenyl)acetamide 2-(1-ethyl-2,4-dioxoquinazolin-3-yl)-N-(3,4,5-trimethoxyphenyl)acetamide MLS000521250 cid_5146720
Type:
Small organic molecule
Emp. Form.:
C21H23N3O6
Mol. Mass.:
413.4238
SMILES:
CCn1c2ccccc2c(=O)n(CC(=O)Nc2cc(OC)c(OC)c(OC)c2)c1=O
: