Target
E3 ubiquitin-protein ligase Mdm2
Ligand
BDBM43396
Substrate
Meas. Tech.
E3 Ligase dose-response_384
EC50
1090±n/a nM
Citation
 PubChem, PC E3 Ligase dose-response_384 PubChem Bioassay (2008)[AID] 
Target
Name:
E3 ubiquitin-protein ligase Mdm2
Synonyms:
Double minute 2 protein E3 ubiquitin-protein ligase Mdm2 (p53-binding protein Mdm2) Human Double Minute 2 (HDM2) MDM2-MDMX p53-Binding Protein MDM2 | p53-binding protein
Type:
Oncoprotein
Mol. Mass.:
55196.54
Organism:
Homo sapiens (Human)
Description:
Q00987
Residue:
491
  
Inhibitor
Name:
BDBM43396
Synonyms:
(E)-N-(5-Methyl-2H-[1,2,4]triazol-3-yl)-3-phenyl-acrylamide (E)-N-(5-methyl-1H-1,2,4-triazol-3-yl)-3-phenyl-acrylamide (E)-N-(5-methyl-1H-1,2,4-triazol-3-yl)-3-phenylprop-2-enamide SMR000218688 | cid_946304
Type:
Small organic molecule
Emp. Form.:
C12H12N4O
Mol. Mass.:
228.2499
SMILES:
Cc1nnc(NC(=O)C=Cc2ccccc2)[nH]1
: