Target
E3 ubiquitin-protein ligase Mdm2
Ligand
BDBM43405
Substrate
Meas. Tech.
E3 Ligase dose-response_384
EC50
12580±n/a nM
Citation
 PubChem, PC E3 Ligase dose-response_384 PubChem Bioassay (2008)[AID] 
Target
Name:
E3 ubiquitin-protein ligase Mdm2
Synonyms:
Double minute 2 protein E3 ubiquitin-protein ligase Mdm2 (p53-binding protein Mdm2) Human Double Minute 2 (HDM2) MDM2-MDMX p53-Binding Protein MDM2 | p53-binding protein
Type:
Oncoprotein
Mol. Mass.:
55196.54
Organism:
Homo sapiens (Human)
Description:
Q00987
Residue:
491
  
Inhibitor
Name:
BDBM43405
Synonyms:
5-(3-chlorophenyl)-2-[(cyclopentylamino)methylene]cyclohexane-1,3-dione 5-(3-chlorophenyl)-2-[(cyclopentylamino)methylidene]cyclohexane-1,3-dione SMR000204477 | cid_4599064
Type:
Small organic molecule
Emp. Form.:
C18H20ClNO2
Mol. Mass.:
317.81
SMILES:
Clc1cccc(c1)C1CC(=O)C(=CNC2CCCC2)C(=O)C1
: