Target
E3 ubiquitin-protein ligase Mdm2
Ligand
BDBM43428
Substrate
Meas. Tech.
E3 Ligase dose-response_384
EC50
20±n/a nM
Citation
 PubChem, PC E3 Ligase dose-response_384 PubChem Bioassay (2008)[AID] 
Target
Name:
E3 ubiquitin-protein ligase Mdm2
Synonyms:
Double minute 2 protein E3 ubiquitin-protein ligase Mdm2 (p53-binding protein Mdm2) Human Double Minute 2 (HDM2) MDM2-MDMX p53-Binding Protein MDM2 | p53-binding protein
Type:
Oncoprotein
Mol. Mass.:
55196.54
Organism:
Homo sapiens (Human)
Description:
Q00987
Residue:
491
  
Inhibitor
Name:
BDBM43428
Synonyms:
3-[(4-isopropylphenoxy)methyl]-N'-(3-pyridinylmethylene)benzohydrazide 3-[(4-propan-2-ylphenoxy)methyl]-N-(3-pyridinylmethylideneamino)benzamide MLS000698222 cid_1229743
Type:
Small organic molecule
Emp. Form.:
C23H23N3O2
Mol. Mass.:
373.4476
SMILES:
CC(C)c1ccc(OCc2cccc(c2)C(=O)NN=Cc2cccnc2)cc1
: