Target
E3 ubiquitin-protein ligase Mdm2
Ligand
BDBM43473
Substrate
Meas. Tech.
E3 Ligase dose-response_384
EC50
441430±n/a nM
Citation
 PubChem, PC E3 Ligase dose-response_384 PubChem Bioassay (2008)[AID] 
Target
Name:
E3 ubiquitin-protein ligase Mdm2
Synonyms:
Double minute 2 protein E3 ubiquitin-protein ligase Mdm2 (p53-binding protein Mdm2) Human Double Minute 2 (HDM2) MDM2-MDMX p53-Binding Protein MDM2 | p53-binding protein
Type:
Oncoprotein
Mol. Mass.:
55196.54
Organism:
Homo sapiens (Human)
Description:
Q00987
Residue:
491
  
Inhibitor
Name:
BDBM43473
Synonyms:
(5-phenyl-1,3,4-oxadiazol-2-yl)-(2-thienyl)methanol (5-phenyl-1,3,4-oxadiazol-2-yl)-thiophen-2-ylmethanol SMR000376996 | cid_4964129
Type:
Small organic molecule
Emp. Form.:
C13H10N2O2S
Mol. Mass.:
258.296
SMILES:
OC(c1cccs1)c1nnc(o1)-c1ccccc1
: