Target
E3 ubiquitin-protein ligase Mdm2
Ligand
BDBM43479
Substrate
Meas. Tech.
E3 Ligase dose-response_384
EC50
610±n/a nM
Citation
 PubChem, PC E3 Ligase dose-response_384 PubChem Bioassay (2008)[AID] 
Target
Name:
E3 ubiquitin-protein ligase Mdm2
Synonyms:
Double minute 2 protein E3 ubiquitin-protein ligase Mdm2 (p53-binding protein Mdm2) Human Double Minute 2 (HDM2) MDM2-MDMX p53-Binding Protein MDM2 | p53-binding protein
Type:
Oncoprotein
Mol. Mass.:
55196.54
Organism:
Homo sapiens (Human)
Description:
Q00987
Residue:
491
  
Inhibitor
Name:
BDBM43479
Synonyms:
1-Piperidinecarboxylic acid, 4-oxo-3,5-bis(phenyl- methylene)-, ethyl ester 4-oxo-3,5-bis(phenylmethylene)-1-piperidinecarboxylic acid ethyl ester SMR000529054 ethyl 3,5-dibenzylidene-4-oxopiperidine-1-carboxylate | ethyl 4-oxidanylidene-3,5-bis(phenylmethylidene)piperidine-1-carboxylate
Type:
Small organic molecule
Emp. Form.:
C22H21NO3
Mol. Mass.:
347.407
SMILES:
CCOC(=O)N1CC(=Cc2ccccc2)C(=O)C(C1)=Cc1ccccc1
: