Target
E3 ubiquitin-protein ligase Mdm2
Ligand
BDBM43480
Substrate
Meas. Tech.
E3 Ligase dose-response_384
EC50
1030±n/a nM
Citation
 PubChem, PC E3 Ligase dose-response_384 PubChem Bioassay (2008)[AID] 
Target
Name:
E3 ubiquitin-protein ligase Mdm2
Synonyms:
Double minute 2 protein E3 ubiquitin-protein ligase Mdm2 (p53-binding protein Mdm2) Human Double Minute 2 (HDM2) MDM2-MDMX p53-Binding Protein MDM2 | p53-binding protein
Type:
Oncoprotein
Mol. Mass.:
55196.54
Organism:
Homo sapiens (Human)
Description:
Q00987
Residue:
491
  
Inhibitor
Name:
BDBM43480
Synonyms:
11H-Benzo[a]carbazole-1,4-dione, 7,11-dimethyl- 7,11-dimethylbenzo[a]carbazole-1,4-quinone SMR000529086 | cid_371271
Type:
Small organic molecule
Emp. Form.:
C18H13NO2
Mol. Mass.:
275.3013
SMILES:
Cc1cccc2n(C)c3c4C(=O)C=CC(=O)c4ccc3c12
: