Target
E3 ubiquitin-protein ligase Mdm2
Ligand
BDBM43487
Substrate
Meas. Tech.
E3 Ligase dose-response_384
EC50
22860±n/a nM
Citation
 PubChem, PC E3 Ligase dose-response_384 PubChem Bioassay (2008)[AID] 
Target
Name:
E3 ubiquitin-protein ligase Mdm2
Synonyms:
Double minute 2 protein E3 ubiquitin-protein ligase Mdm2 (p53-binding protein Mdm2) Human Double Minute 2 (HDM2) MDM2-MDMX p53-Binding Protein MDM2 | p53-binding protein
Type:
Oncoprotein
Mol. Mass.:
55196.54
Organism:
Homo sapiens (Human)
Description:
Q00987
Residue:
491
  
Inhibitor
Name:
BDBM43487
Synonyms:
2-amino-N-[3-methoxy-5-[[3-(trifluoromethyl)phenyl]carbamoyl]phenyl]-1,3-thiazole-5-carboxamide 2-amino-N-[3-methoxy-5-[oxo-[3-(trifluoromethyl)anilino]methyl]phenyl]-5-thiazolecarboxamide MLS000911505 cid_16745806
Type:
Small organic molecule
Emp. Form.:
C19H15F3N4O3S
Mol. Mass.:
436.408
SMILES:
COc1cc(NC(=O)c2cnc(N)s2)cc(c1)C(=O)Nc1cccc(c1)C(F)(F)F
: