Target
E3 ubiquitin-protein ligase Mdm2
Ligand
BDBM43496
Substrate
Meas. Tech.
E3 Ligase dose-response_384
EC50
11070±n/a nM
Citation
 PubChem, PC E3 Ligase dose-response_384 PubChem Bioassay (2008)[AID] 
Target
Name:
E3 ubiquitin-protein ligase Mdm2
Synonyms:
Double minute 2 protein E3 ubiquitin-protein ligase Mdm2 (p53-binding protein Mdm2) Human Double Minute 2 (HDM2) MDM2-MDMX p53-Binding Protein MDM2 | p53-binding protein
Type:
Oncoprotein
Mol. Mass.:
55196.54
Organism:
Homo sapiens (Human)
Description:
Q00987
Residue:
491
  
Inhibitor
Name:
BDBM43496
Synonyms:
MLS000877506 cid_16745983
Type:
Small organic molecule
Emp. Form.:
C25H23BrN4O
Mol. Mass.:
475.38
SMILES:
CN1C(CC2Cn3c(nc4cc5ccccc5cc34)C12)C(=O)NCc1cccc(Br)c1
: