Target
Signal transducer and activator of transcription 1-alpha/beta
Ligand
BDBM43501
Substrate
Meas. Tech.
Dose response cell-based assay to measure STAT1 inhibition
IC50
11870±n/a nM
Citation
 PubChem, PC Dose response cell-based assay to measure STAT1 inhibition PubChem Bioassay (2008)[AID] 
Target
Name:
Signal transducer and activator of transcription 1-alpha/beta
Synonyms:
STAT1 Signal transducer and activator of transcription 1-alpha/beta Transcription factor ISGF-3 components p91/p84 | signal transducer and activator of transcription 1 isoform alpha
Type:
Cytosolic Transcription Factor
Mol. Mass.:
87327.69
Organism:
Homo sapiens (Human)
Description:
Stat1 was expressed in sf9 cells from a baculovirus encoding the recombinant proteins. Stat1 dimer binds to DNA.
Residue:
750
  
Inhibitor
Name:
BDBM43501
Synonyms:
3-[4-(4-methoxyphenyl)-6-(trifluoromethyl)pyrimidin-2-yl]sulfonyl-N-(1-methoxypropan-2-yl)propanamide MLS000029790 N-(2-methoxy-1-methyl-ethyl)-3-[4-(4-methoxyphenyl)-6-(trifluoromethyl)pyrimidin-2-yl]sulfonyl-propionamide cid_654688
Type:
Small organic molecule
Emp. Form.:
C19H22F3N3O5S
Mol. Mass.:
461.455
SMILES:
COCC(C)NC(=O)CCS(=O)(=O)c1nc(cc(n1)C(F)(F)F)-c1ccc(OC)cc1
: