Target
Signal transducer and activator of transcription 1-alpha/beta
Ligand
BDBM38996
Substrate
Meas. Tech.
Dose response cell-based assay to measure STAT1 inhibition
IC50
16860±n/a nM
Citation
 PubChem, PC Dose response cell-based assay to measure STAT1 inhibition PubChem Bioassay (2008)[AID] 
Target
Name:
Signal transducer and activator of transcription 1-alpha/beta
Synonyms:
STAT1 Signal transducer and activator of transcription 1-alpha/beta Transcription factor ISGF-3 components p91/p84 | signal transducer and activator of transcription 1 isoform alpha
Type:
Cytosolic Transcription Factor
Mol. Mass.:
87327.69
Organism:
Homo sapiens (Human)
Description:
Stat1 was expressed in sf9 cells from a baculovirus encoding the recombinant proteins. Stat1 dimer binds to DNA.
Residue:
750
  
Inhibitor
Name:
BDBM38996
Synonyms:
MLS000086269 N-(5-methyl-1,2-oxazol-3-yl)-4-[4-thiophen-2-yl-6-(trifluoromethyl)pyrimidin-2-yl]sulfonylbutanamide N-(5-methylisoxazol-3-yl)-4-[4-(2-thienyl)-6-(trifluoromethyl)pyrimidin-2-yl]sulfonyl-butyramide SMR000021778 | cid_3245634
Type:
Small organic molecule
Emp. Form.:
C17H15F3N4O4S2
Mol. Mass.:
460.451
SMILES:
Cc1cc(NC(=O)CCCS(=O)(=O)c2nc(cc(n2)C(F)(F)F)-c2cccs2)no1
: