Target
Signal transducer and activator of transcription 1-alpha/beta
Ligand
BDBM43512
Substrate
Meas. Tech.
Dose response cell-based assay to measure STAT1 inhibition
IC50
5195±n/a nM
Citation
 PubChem, PC Dose response cell-based assay to measure STAT1 inhibition PubChem Bioassay (2008)[AID] 
Target
Name:
Signal transducer and activator of transcription 1-alpha/beta
Synonyms:
STAT1 Signal transducer and activator of transcription 1-alpha/beta Transcription factor ISGF-3 components p91/p84 | signal transducer and activator of transcription 1 isoform alpha
Type:
Cytosolic Transcription Factor
Mol. Mass.:
87327.69
Organism:
Homo sapiens (Human)
Description:
Stat1 was expressed in sf9 cells from a baculovirus encoding the recombinant proteins. Stat1 dimer binds to DNA.
Residue:
750
  
Inhibitor
Name:
BDBM43512
Synonyms:
3-(3,4-dimethylphenyl)-4-keto-phthalazine-1-carboxylic acid 3-(3,4-dimethylphenyl)-4-oxo-1-phthalazinecarboxylic acid 3-(3,4-dimethylphenyl)-4-oxophthalazine-1-carboxylic acid SMR000126726 | cid_3743088
Type:
Small organic molecule
Emp. Form.:
C17H14N2O3
Mol. Mass.:
294.3047
SMILES:
Cc1ccc(cc1C)-n1nc(C(O)=O)c2ccccc2c1=O
: