Target
Signal transducer and activator of transcription 1-alpha/beta
Ligand
BDBM43528
Substrate
Meas. Tech.
Dose response cell-based assay to measure STAT1 inhibition
IC50
>55700±n/a nM
Citation
 PubChem, PC Dose response cell-based assay to measure STAT1 inhibition PubChem Bioassay (2008)[AID] 
Target
Name:
Signal transducer and activator of transcription 1-alpha/beta
Synonyms:
STAT1 Signal transducer and activator of transcription 1-alpha/beta Transcription factor ISGF-3 components p91/p84 | signal transducer and activator of transcription 1 isoform alpha
Type:
Cytosolic Transcription Factor
Mol. Mass.:
87327.69
Organism:
Homo sapiens (Human)
Description:
Stat1 was expressed in sf9 cells from a baculovirus encoding the recombinant proteins. Stat1 dimer binds to DNA.
Residue:
750
  
Inhibitor
Name:
BDBM43528
Synonyms:
(4-chlorophenyl)-[4-(7-chloro-4-quinolinyl)-1-piperazinyl]methanone (4-chlorophenyl)-[4-(7-chloroquinolin-4-yl)piperazin-1-yl]methanone MLS000676065 [4-(7-chloranylquinolin-4-yl)piperazin-1-yl]-(4-chlorophenyl)methanone | cid_1251584
Type:
Small organic molecule
Emp. Form.:
C20H17Cl2N3O
Mol. Mass.:
386.274
SMILES:
Clc1ccc(cc1)C(=O)N1CCN(CC1)c1ccnc2cc(Cl)ccc12
: