Target
Signal transducer and activator of transcription 1-alpha/beta
Ligand
BDBM43544
Substrate
Meas. Tech.
Dose response cell-based assay to measure STAT1 inhibition
IC50
>55700±n/a nM
Citation
 PubChem, PC Dose response cell-based assay to measure STAT1 inhibition PubChem Bioassay (2008)[AID] 
Target
Name:
Signal transducer and activator of transcription 1-alpha/beta
Synonyms:
STAT1 Signal transducer and activator of transcription 1-alpha/beta Transcription factor ISGF-3 components p91/p84 | signal transducer and activator of transcription 1 isoform alpha
Type:
Cytosolic Transcription Factor
Mol. Mass.:
87327.69
Organism:
Homo sapiens (Human)
Description:
Stat1 was expressed in sf9 cells from a baculovirus encoding the recombinant proteins. Stat1 dimer binds to DNA.
Residue:
750
  
Inhibitor
Name:
BDBM43544
Synonyms:
3-(2,3-dihydroindol-1-ylsulfonyl)-N'-(phenylcarbonyl)benzohydrazide N'-benzoyl-3-(2,3-dihydroindol-1-ylsulfonyl)benzohydrazide SMR000372620 | cid_2476398
Type:
Small organic molecule
Emp. Form.:
C22H19N3O4S
Mol. Mass.:
421.469
SMILES:
O=C(NNC(=O)c1cccc(c1)S(=O)(=O)N1CCc2ccccc12)c1ccccc1
: