Target
Signal transducer and activator of transcription 3 [702-738,740-752]
Ligand
BDBM43547
Substrate
Meas. Tech.
Dose response cell-based assay to measure STAT3 activation
IC50
5095±n/a nM
Citation
 PubChem, PC Dose response cell-based assay to measure STAT3 activation PubChem Bioassay (2008)[AID] 
Target
Name:
Signal transducer and activator of transcription 3 [702-738,740-752]
Synonyms:
APRF STAT3_HUMAN
Type:
Enzyme Catalytic Domain
Mol. Mass.:
5263.93
Organism:
Homo sapiens (Human)
Description:
gi_13272532
Residue:
50
  
Inhibitor
Name:
BDBM43547
Synonyms:
(3-Cyano-2-methyl-indol-1-yl)-acetic acid 2-(3-cyano-2-methyl-indol-1-yl)acetic acid 2-(3-cyano-2-methylindol-1-yl)acetic acid SMR000013849 | cid_653215
Type:
Small organic molecule
Emp. Form.:
C12H10N2O2
Mol. Mass.:
214.22
SMILES:
Cc1c(C#N)c2ccccc2n1CC(O)=O
: