Target
Signal transducer and activator of transcription 3 [702-738,740-752]
Ligand
BDBM43581
Substrate
Meas. Tech.
Dose response cell-based assay to measure STAT3 activation
IC50
1872±n/a nM
Citation
 PubChem, PC Dose response cell-based assay to measure STAT3 activation PubChem Bioassay (2008)[AID] 
Target
Name:
Signal transducer and activator of transcription 3 [702-738,740-752]
Synonyms:
APRF STAT3_HUMAN
Type:
Enzyme Catalytic Domain
Mol. Mass.:
5263.93
Organism:
Homo sapiens (Human)
Description:
gi_13272532
Residue:
50
  
Inhibitor
Name:
BDBM43581
Synonyms:
MLS000116547 N-cyclohexyl-2-[[5-(2-methoxyphenyl)-1,3,4-oxadiazol-2-yl]sulfanyl]ethanamide SMR000093517 | cid_2155708
Type:
Small organic molecule
Emp. Form.:
C17H21N3O3S
Mol. Mass.:
347.432
SMILES:
COc1ccccc1-c1nnc(SCC(=O)NC2CCCCC2)o1
: