Target
Signal transducer and activator of transcription 3 [702-738,740-752]
Ligand
BDBM43615
Substrate
Meas. Tech.
Dose response cell-based assay to measure STAT3 activation
IC50
3325±n/a nM
Citation
 PubChem, PC Dose response cell-based assay to measure STAT3 activation PubChem Bioassay (2008)[AID] 
Target
Name:
Signal transducer and activator of transcription 3 [702-738,740-752]
Synonyms:
APRF STAT3_HUMAN
Type:
Enzyme Catalytic Domain
Mol. Mass.:
5263.93
Organism:
Homo sapiens (Human)
Description:
gi_13272532
Residue:
50
  
Inhibitor
Name:
BDBM43615
Synonyms:
2-(2-keto-4-methyl-pyrimid[1,2-b]indazol-6-yl)-N-propyl-acetamide 2-(4-methyl-2-oxo-6-pyrimido[1,2-b]indazolyl)-N-propylacetamide MLS000522787 cid_3249106
Type:
Small organic molecule
Emp. Form.:
C16H18N4O2
Mol. Mass.:
298.3397
SMILES:
CCCNC(=O)Cn1c2ccccc2c2nc(=O)cc(C)n12
: