Target
Signal transducer and activator of transcription 3 [702-738,740-752]
Ligand
BDBM43626
Substrate
Meas. Tech.
Dose response cell-based assay to measure STAT3 activation
IC50
>55700±n/a nM
Citation
 PubChem, PC Dose response cell-based assay to measure STAT3 activation PubChem Bioassay (2008)[AID] 
Target
Name:
Signal transducer and activator of transcription 3 [702-738,740-752]
Synonyms:
APRF STAT3_HUMAN
Type:
Enzyme Catalytic Domain
Mol. Mass.:
5263.93
Organism:
Homo sapiens (Human)
Description:
gi_13272532
Residue:
50
  
Inhibitor
Name:
BDBM43626
Synonyms:
2-[1-(2-ethoxybenzyl)-4-(1H-indol-2-ylmethyl)piperazin-2-yl]ethanol 2-[1-[(2-ethoxyphenyl)methyl]-4-(1H-indol-2-ylmethyl)piperazin-2-yl]ethanol SMR000317995 | cid_16188244
Type:
Small organic molecule
Emp. Form.:
C24H31N3O2
Mol. Mass.:
393.5218
SMILES:
CCOc1ccccc1CN1CCN(Cc2cc3ccccc3[nH]2)CC1CCO
: