Target
Signal transducer and activator of transcription 3 [702-738,740-752]
Ligand
BDBM43644
Substrate
Meas. Tech.
Dose response cell-based assay to measure STAT3 activation
IC50
2439±n/a nM
Citation
 PubChem, PC Dose response cell-based assay to measure STAT3 activation PubChem Bioassay (2008)[AID] 
Target
Name:
Signal transducer and activator of transcription 3 [702-738,740-752]
Synonyms:
APRF STAT3_HUMAN
Type:
Enzyme Catalytic Domain
Mol. Mass.:
5263.93
Organism:
Homo sapiens (Human)
Description:
gi_13272532
Residue:
50
  
Inhibitor
Name:
BDBM43644
Synonyms:
MLS000715265 N-(2-hydroxyphenyl)-4,5,6,7-tetrahydrobenzothiophene-3-carboxamide cid_821304
Type:
Small organic molecule
Emp. Form.:
C15H15NO2S
Mol. Mass.:
273.35
SMILES:
Oc1ccccc1NC(=O)c1csc2CCCCc12
: