Target
Signal transducer and activator of transcription 3 [702-738,740-752]
Ligand
BDBM43654
Substrate
Meas. Tech.
Dose response cell-based assay to measure STAT3 activation
IC50
>55700±n/a nM
Citation
 PubChem, PC Dose response cell-based assay to measure STAT3 activation PubChem Bioassay (2008)[AID] 
Target
Name:
Signal transducer and activator of transcription 3 [702-738,740-752]
Synonyms:
APRF STAT3_HUMAN
Type:
Enzyme Catalytic Domain
Mol. Mass.:
5263.93
Organism:
Homo sapiens (Human)
Description:
gi_13272532
Residue:
50
  
Inhibitor
Name:
BDBM43654
Synonyms:
7,8-dihydro-6H-cyclopenta[4,5]thieno[1,2-c]pyrimidin-1-yldiazane MLS001019034 cid_722717
Type:
Small organic molecule
Emp. Form.:
C9H10N4S
Mol. Mass.:
206.268
SMILES:
NNc1ncnc2sc3CCCc3c12
: