Target
Signal transducer and activator of transcription 3 [702-738,740-752]
Ligand
BDBM43706
Substrate
Meas. Tech.
Dose response counterscreen for STAT1 activators: cell-based high throughput assay to measure STAT3 activation
EC50
>55700±n/a nM
Citation
 PubChem, PC Dose response counterscreen for STAT1 activators: cell-based high throughput assay to measure STAT3 activation PubChem Bioassay (2008)[AID] 
Target
Name:
Signal transducer and activator of transcription 3 [702-738,740-752]
Synonyms:
APRF STAT3_HUMAN
Type:
Enzyme Catalytic Domain
Mol. Mass.:
5263.93
Organism:
Homo sapiens (Human)
Description:
gi_13272532
Residue:
50
  
Inhibitor
Name:
BDBM43706
Synonyms:
MLS000392562 N-[(3-cyano-5,6,7,8-tetrahydro-4H-cyclohepta[b]thiophen-2-yl)carbamothioyl]ethanamide N-[[(3-cyano-5,6,7,8-tetrahydro-4H-cyclohepta[b]thiophen-2-yl)amino]-sulfanylidenemethyl]acetamide cid_5142145
Type:
Small organic molecule
Emp. Form.:
C13H15N3OS2
Mol. Mass.:
293.408
SMILES:
CC(=O)NC(=S)Nc1sc2CCCCCc2c1C#N
: