Target
Signal transducer and activator of transcription 3 [702-738,740-752]
Ligand
BDBM43707
Substrate
Meas. Tech.
Dose response counterscreen for STAT1 activators: cell-based high throughput assay to measure STAT3 activation
EC50
>55700±n/a nM
Citation
 PubChem, PC Dose response counterscreen for STAT1 activators: cell-based high throughput assay to measure STAT3 activation PubChem Bioassay (2008)[AID] 
Target
Name:
Signal transducer and activator of transcription 3 [702-738,740-752]
Synonyms:
APRF STAT3_HUMAN
Type:
Enzyme Catalytic Domain
Mol. Mass.:
5263.93
Organism:
Homo sapiens (Human)
Description:
gi_13272532
Residue:
50
  
Inhibitor
Name:
BDBM43707
Synonyms:
2-(2-phenyl-1,3-benzothiazol-5-yl)acetamide MLS000391716 cid_726461
Type:
Small organic molecule
Emp. Form.:
C15H12N2OS
Mol. Mass.:
268.334
SMILES:
NC(=O)Cc1ccc2sc(nc2c1)-c1ccccc1
: