Target
Signal transducer and activator of transcription 3 [702-738,740-752]
Ligand
BDBM43709
Substrate
Meas. Tech.
Dose response counterscreen for STAT1 activators: cell-based high throughput assay to measure STAT3 activation
EC50
>55700±n/a nM
Citation
 PubChem, PC Dose response counterscreen for STAT1 activators: cell-based high throughput assay to measure STAT3 activation PubChem Bioassay (2008)[AID] 
Target
Name:
Signal transducer and activator of transcription 3 [702-738,740-752]
Synonyms:
APRF STAT3_HUMAN
Type:
Enzyme Catalytic Domain
Mol. Mass.:
5263.93
Organism:
Homo sapiens (Human)
Description:
gi_13272532
Residue:
50
  
Inhibitor
Name:
BDBM43709
Synonyms:
MLS000681135 N-[(3-acetylphenyl)carbamothioyl]-3-methylbenzamide N-[(3-ethanoylphenyl)carbamothioyl]-3-methyl-benzamide SMR000269386 | cid_833124
Type:
Small organic molecule
Emp. Form.:
C17H16N2O2S
Mol. Mass.:
312.386
SMILES:
CC(=O)c1cccc(NC(=S)NC(=O)c2cccc(C)c2)c1
: