Target
Signal transducer and activator of transcription 1-alpha/beta
Ligand
BDBM43549
Substrate
Meas. Tech.
Dose response counterscreen assay for STAT3 activators: cell-based high throughput assay to measure STAT1 activation
EC50
>55700±n/a nM
Citation
 PubChem, PC Dose response counterscreen assay for STAT3 activators: cell-based high throughput assay to measure STAT1 activation PubChem Bioassay (2008)[AID] 
Target
Name:
Signal transducer and activator of transcription 1-alpha/beta
Synonyms:
STAT1 Signal transducer and activator of transcription 1-alpha/beta Transcription factor ISGF-3 components p91/p84 | signal transducer and activator of transcription 1 isoform alpha
Type:
Cytosolic Transcription Factor
Mol. Mass.:
87327.69
Organism:
Homo sapiens (Human)
Description:
Stat1 was expressed in sf9 cells from a baculovirus encoding the recombinant proteins. Stat1 dimer binds to DNA.
Residue:
750
  
Inhibitor
Name:
BDBM43549
Synonyms:
3-(6-Ethyl-2-methyl-thieno[2,3-d]pyrimidin-4-ylamino)-propionic acid 3-[(6-ethyl-2-methyl-thieno[2,3-d]pyrimidin-4-yl)amino]propanoic acid 3-[(6-ethyl-2-methylthieno[2,3-d]pyrimidin-4-yl)amino]propanoic acid SMR000014428 | cid_654691
Type:
Small organic molecule
Emp. Form.:
C12H15N3O2S
Mol. Mass.:
265.331
SMILES:
CCc1cc2c(NCCC(O)=O)nc(C)nc2s1
: