Target
Signal transducer and activator of transcription 1-alpha/beta
Ligand
BDBM43554
Substrate
Meas. Tech.
Dose response counterscreen assay for STAT3 activators: cell-based high throughput assay to measure STAT1 activation
EC50
>55700±n/a nM
Citation
 PubChem, PC Dose response counterscreen assay for STAT3 activators: cell-based high throughput assay to measure STAT1 activation PubChem Bioassay (2008)[AID] 
Target
Name:
Signal transducer and activator of transcription 1-alpha/beta
Synonyms:
STAT1 Signal transducer and activator of transcription 1-alpha/beta Transcription factor ISGF-3 components p91/p84 | signal transducer and activator of transcription 1 isoform alpha
Type:
Cytosolic Transcription Factor
Mol. Mass.:
87327.69
Organism:
Homo sapiens (Human)
Description:
Stat1 was expressed in sf9 cells from a baculovirus encoding the recombinant proteins. Stat1 dimer binds to DNA.
Residue:
750
  
Inhibitor
Name:
BDBM43554
Synonyms:
MLS000078111 N-(5-chloro-2-hydroxy-phenyl)-2-methoxy-benzamide SMR000037335 | cid_483833
Type:
Small organic molecule
Emp. Form.:
C14H12ClNO3
Mol. Mass.:
277.703
SMILES:
COc1ccccc1C(=O)Nc1cc(Cl)ccc1O
: