Target
Signal transducer and activator of transcription 1-alpha/beta
Ligand
BDBM43556
Substrate
Meas. Tech.
Dose response counterscreen assay for STAT3 activators: cell-based high throughput assay to measure STAT1 activation
EC50
>55700±n/a nM
Citation
 PubChem, PC Dose response counterscreen assay for STAT3 activators: cell-based high throughput assay to measure STAT1 activation PubChem Bioassay (2008)[AID] 
Target
Name:
Signal transducer and activator of transcription 1-alpha/beta
Synonyms:
STAT1 Signal transducer and activator of transcription 1-alpha/beta Transcription factor ISGF-3 components p91/p84 | signal transducer and activator of transcription 1 isoform alpha
Type:
Cytosolic Transcription Factor
Mol. Mass.:
87327.69
Organism:
Homo sapiens (Human)
Description:
Stat1 was expressed in sf9 cells from a baculovirus encoding the recombinant proteins. Stat1 dimer binds to DNA.
Residue:
750
  
Inhibitor
Name:
BDBM43556
Synonyms:
2-[2-(dimethylamino)-2-(1-methyl-3-indolyl)ethyl]-3a,4,7,7a-tetrahydroisoindole-1,3-dione;hydrochloride 2-[2-(dimethylamino)-2-(1-methylindol-3-yl)ethyl]-3a,4,7,7a-tetrahydroisoindole-1,3-quinone;hydrochloride SMR000040421 | cid_6603391
Type:
Small organic molecule
Emp. Form.:
C21H25N3O2
Mol. Mass.:
351.4421
SMILES:
CN(C)C(CN1C(=O)C2CC=CCC2C1=O)c1cn(C)c2ccccc12
: