Target
Signal transducer and activator of transcription 1-alpha/beta
Ligand
BDBM43558
Substrate
Meas. Tech.
Dose response counterscreen assay for STAT3 activators: cell-based high throughput assay to measure STAT1 activation
EC50
>55700±n/a nM
Citation
 PubChem, PC Dose response counterscreen assay for STAT3 activators: cell-based high throughput assay to measure STAT1 activation PubChem Bioassay (2008)[AID] 
Target
Name:
Signal transducer and activator of transcription 1-alpha/beta
Synonyms:
STAT1 Signal transducer and activator of transcription 1-alpha/beta Transcription factor ISGF-3 components p91/p84 | signal transducer and activator of transcription 1 isoform alpha
Type:
Cytosolic Transcription Factor
Mol. Mass.:
87327.69
Organism:
Homo sapiens (Human)
Description:
Stat1 was expressed in sf9 cells from a baculovirus encoding the recombinant proteins. Stat1 dimer binds to DNA.
Residue:
750
  
Inhibitor
Name:
BDBM43558
Synonyms:
(6E)-2-methoxy-6-[4-(2-methyl-1-piperidinyl)-1H-quinazolin-2-ylidene]-1-cyclohexa-2,4-dienone (6E)-2-methoxy-6-[4-(2-methylpiperidino)-1H-quinazolin-2-ylidene]cyclohexa-2,4-dien-1-one SMR000042460 | cid_5389372
Type:
Small organic molecule
Emp. Form.:
C21H23N3O2
Mol. Mass.:
349.4262
SMILES:
COc1cccc(c1O)-c1nc(N2CCCCC2C)c2ccccc2n1
: